DSXchange: DataStage and IBM Websphere Data Integration Forum
View next topic
View previous topic
Add To Favorites
Author Message
rebamu
Participant



Joined: 21 Aug 2017
Posts: 5

Points: 92

Post Posted: Wed Aug 23, 2017 12:38 pm Reply with quote    Back to top    

DataStage® Release: 11x
Job Type: Parallel
OS: Unix
Hi All,

I am working on migrating jobs from 8.7 to 11.5 we have some transformer stages that are not compiling. Kindly help me.

in the below error the path highlighted in bold(/dsd/fep/lib) is not available in unix but still it is taking that value, not able to understand from where that value is being taken.

checked the admin params and dsenv but still not able to find it.

Error Details

##W IIS-DSEE-TOSH-00049 09:16:50(007) <main_program> Parameter specified but not used in flow: DSPXWorkingDir
##E IIS-DSEE-TBLD-00076 09:16:50(008) <main_program> Error when checking composite operator: Subprocess command failed with exit status 256.
##E IIS-DSEE-TFSR-00019 09:16:50(009) <main_program> Could not check all operators because of previous error(s)
##W IIS-DSEE-TFTM-00012 09:16:50(010) <transform> Error when checking composite operator: The number of reject datasets "0" is less than the number of input datasets "1".
##W IIS-DSEE-TBLD-00000 09:16:50(011) <main_program> Error when checking composite operator: Output from subprocess: /usr/bin/ld: cannot find -lEdit

##W IIS-DSEE-TBLD-00000 09:16:50(012) <main_program> Error when checking composite operator: Output from subprocess: collect2: error: ld returned 1 exit status

##I IIS-DSEE-TBLD-00079 09:16:50(013) <transform> Error when checking composite operator: g++ -L/datastage/projects/pname/RT_BP2.O/ -L/dsd/fep/lib/ -L/opt/IBM/InformationServer/Server/PXEngine/lib -L/opt/IBM/InformationServer/Server/PXEngine/user_lib -shared -m64 -lorchx86_64 -lorchcorex86_64 -lorchbuildopx86_64 -lEdit /datastage/projects/pnamev/RT_BP2.O/V94S0_CALL1_XFMR_HTTP_ENCODING.tmp.o -o /datastage/projects/pname/RT_BP2.O/V94S0_CALL1_XFMR_HTTP_ENCODING.so.
##E IIS-DSEE-TCOS-00029 09:16:50(014) <main_program> Creation of a step finished with status = FAILED. (CALL1.XFMR_HTTP_ENCODING)

_________________
Rebe
chulett

Premium Poster


since January 2006

Group memberships:
Premium Members, Inner Circle, Server to Parallel Transition Group

Joined: 12 Nov 2002
Posts: 43085
Location: Denver, CO
Points: 222463

Post Posted: Wed Aug 23, 2017 1:24 pm Reply with quote    Back to top    

So... some jobs with transformer stages are not compiling or all jobs with transformer stages in them do not compile?

_________________
-craig

"You can never have too many knives" -- Logan Nine Fingers
Rate this response:  
Not yet rated
rebamu
Participant



Joined: 21 Aug 2017
Posts: 5

Points: 92

Post Posted: Thu Aug 24, 2017 12:04 am Reply with quote    Back to top    

Some transformers only are not compiling

_________________
Rebe
Rate this response:  
Not yet rated
chulett

Premium Poster


since January 2006

Group memberships:
Premium Members, Inner Circle, Server to Parallel Transition Group

Joined: 12 Nov 2002
Posts: 43085
Location: Denver, CO
Points: 222463

Post Posted: Thu Aug 24, 2017 6:45 am Reply with quote    Back to top    

Okay... so what do these jobs / transformers have in common? Are they all calling some kind of custom routine? That's what the error message you posted is implying to me when it mentions "V94S0_CALL1_XFMR_HTTP_ENCODING.so". Perhaps it's missing / wasn't migrated / needs to be recompiled? Confused

_________________
-craig

"You can never have too many knives" -- Logan Nine Fingers
Rate this response:  
Not yet rated
ray.wurlod

Premium Poster
Participant

Group memberships:
Premium Members, Inner Circle, Australia Usergroup, Server to Parallel Transition Group

Joined: 23 Oct 2002
Posts: 54581
Location: Sydney, Australia
Points: 295981

Post Posted: Sun Aug 27, 2017 9:27 pm Reply with quote    Back to top    

Can you please check that your C++ compiler licence has not expired?

_________________
IBM Software Services Group
Any contribution to this forum is my own opinion and does not necessarily reflect any position that IBM may hold.
Rate this response:  
Not yet rated
kalyhot
Participant



Joined: 02 Jun 2020
Posts: 7

Points: 56

Post Posted: Tue Jun 02, 2020 12:42 pm Reply with quote    Back to top    

rebamu wrote:
Hi All,

I am working on migrating jobs from 8.7 to 11.5 we have some transformer stages that are not compiling. Kindly help me.

step finished with status = FAILED. (CALL1.XFMR_HTTP_ENCODING)


I faced the same issue, you have to install visual C++ 2010 express edition and be sure that this environement variable system is added

var VS100COMNTOOLS

value c:\Program Files (x86)\Microsoft Visual Studio 10.0\Common7\Tools\

for all the verifications must see this
https://www.ibm.com/support/pages/datastage-designer-parallel-job-transformer-stage-fails-compile-windows-2008

_________________
kalyhot DS certified 9 Developper
Rate this response:  
Not yet rated
kalyhot
Participant



Joined: 02 Jun 2020
Posts: 7

Points: 56

Post Posted: Tue Jun 02, 2020 12:43 pm Reply with quote    Back to top    

rebamu wrote:
Hi All,

I am working on migrating jobs from 8.7 to 11.5 we have some transformer stages that are not compiling. Kindly help me.

step finished with status = FAILED. (CALL1.XFMR_HTTP_ENCODING)


I faced the same issue, you have to install visual C++ 2010 express edition and be sure that this environement variable system is added

var VS100COMNTOOLS

value c:\Program Files (x86)\Microsoft Visual Studio 10.0\Common7\Tools\

for all the verifications must see this
https://www.ibm.com/support/pages/datastage-designer-parallel-job-transformer-stage-fails-compile-windows-2008

_________________
kalyhot DS certified 9 Developper
Rate this response:  
Not yet rated
kalyhot
Participant



Joined: 02 Jun 2020
Posts: 7

Points: 56

Post Posted: Tue Jun 02, 2020 12:44 pm Reply with quote    Back to top    

rebamu wrote:
Hi All,

I am working on migrating jobs from 8.7 to 11.5 we have some transformer stages that are not compiling. Kindly help me.

step finished with status = FAILED. (CALL1.XFMR_HTTP_ENCODING)


I faced the same issue, you have to install visual C++ 2010 express edition and be sure that this environement variable system is added

var VS100COMNTOOLS

value c:\Program Files (x86)\Microsoft Visual Studio 10.0\Common7\Tools\

for all the verifications must see this
https://www.ibm.com/support/pages/datastage-designer-parallel-job-transformer-stage-fails-compile-windows-2008

_________________
kalyhot DS certified 9 Developper
Rate this response:  
Not yet rated
ray.wurlod

Premium Poster
Participant

Group memberships:
Premium Members, Inner Circle, Australia Usergroup, Server to Parallel Transition Group

Joined: 23 Oct 2002
Posts: 54581
Location: Sydney, Australia
Points: 295981

Post Posted: Sat Jun 27, 2020 8:14 pm Reply with quote    Back to top    

Your advice to install Visual C++ on a Linux system is singularly unhelpful.

Actually it's trebly unhelpful, since you posted it three times.

_________________
IBM Software Services Group
Any contribution to this forum is my own opinion and does not necessarily reflect any position that IBM may hold.
Rate this response:  
Not yet rated
Display posts from previous:       

Add To Favorites
View next topic
View previous topic
You cannot post new topics in this forum
You cannot reply to topics in this forum
You cannot edit your posts in this forum
You cannot delete your posts in this forum
You cannot vote in polls in this forum



Powered by phpBB © 2001, 2002 phpBB Group
Theme & Graphics by Daz :: Portal by Smartor
All times are GMT - 6 Hours